Home > Curl Error > Curl Error 61

Curl Error 61

Contents

CURLE_HTTP2 (16) A problem was detected in the HTTP2 framing layer. How to respond to your boss's email about a coworker's accusation? Browse other questions tagged php curl encoding or ask your own question. CURLE_OPERATION_TIMEDOUT (28) Operation timeout. http://ogdomains.com/curl-error/curl-error-curl-errno-0.php

How could I make a MAC two time secure? You should also check if your anti-virus is capable of determining viruses that trigger �lost DLL files� prompt message. My boss asks me to stop writing small functions and do everything in the same loop Infinite Fibonacci sums - diverge or converge Head, Shoulders, Knees and Toes, Knees and Toes This includes TCP, UDP, DataSocket, Bluetooth, and IrDA VIs and functions, remote front panel connections, and VI Server applications.

Curl Error Php

CURLE_HTTP_POST_ERROR (34) This is an odd error that mainly occurs due to internal confusion. Also consider curl_share_strerror. Details: error:14090086:SSL routines:SSL3_GET_SERVER_CERTIFICATE … libcurl - Error Codes - curl and libcurl – cURL libcurl API Error Codes libcurl-errors.3 -- man page . You can use the Shared Variable Properties dialog box to configure shared variables to accept multiple writers. 1143 Cannot load dataskt.llb. 1178 LabVIEW reached end of file. 1179 Access mode not

You must use a valid URL to establish a data connection. 1182 Error parsing URL. 1183 Synchronous operation not supported for connection. Curl couldn't parse the 227-line the server sent. 15 FTP can't get host. A specified outgoing interface could not be used. Curl Error 60 Ssl Certificate Problem CURLE_OBSOLETE* These error codes will never be returned.

CURLE_HTTP2_STREAM (92) Stream error in the HTTP/2 framing layer. Curl Error 35 Ssl Connect Error LDAP bind operation failed. Unrecognized transfer encoding. 62. http://php.net/manual/en/function.curl-errno.php CURLE_SSL_SHUTDOWN_FAILED (80) Failed to shut down the SSL connection.

Only a part of the file was trans- fered. 19 FTP couldn't download/access the given file, the RETR (or similar) command failed. 20 FTP write error. Curl Sslread() Return Error -9806 CURLE_LOGIN_DENIED (67) The remote server denied curl to login (Added in 7.13.1) CURLE_TFTP_NOTFOUND (68) File not found on TFTP server. YourFeedback! CURLE_SSL_INVALIDCERTSTATUS (91) Status returned failure when asked with CURLOPT_SSL_VERIFYSTATUS.

Curl Error 35 Ssl Connect Error

CURLE_TFTP_PERM (69) Permission problem on TFTP server. http://stackoverflow.com/questions/10897874/curl-error-while-unencoding CURLE_SSL_ENGINE_INITFAILED (66) Initiating the SSL Engine failed. Curl Error Php The support might be a compile-time option that you didn't use, it can be a misspelled protocol string or just a protocol libcurl has no code for. Curl Http Code What is a PhD student?

What you must do is to find the main cause of the error to take necessary troubleshoot. http://ogdomains.com/curl-error/curl-errors-php.php Set which interface to use for outgoing connections' source IP address with CURLOPT_INTERFACE. For VI Server, make sure the VI Server is enabled on the VI Server page of the Options dialog box. 64 The network connection is not yet established. 65 The network Reload to refresh your session. Curl Error 60

Drinking wine in the winter Mountainering with 6 y.o. When following redirects, curl hit the maximum amount. 48 Unknown TELNET option specified. 49 Malformed telnet option. 51 The remote peer's SSL certificate wasn't ok 52 The server didn't reply anything, CURLE_SSL_CIPHER (59) Couldn't use specified cipher. click site libcurl-errors - error codes in libcurl … CURLE_BAD_CONTENT_ENCODING (61) Unrecognized transfer encoding.

The error buffer usually contains the server's explanation for this. Php Curl Response Code Add Comments 1 2 3 4 5 My Profile|Privacy|Legal|Contact NI© National Instruments Corporation. Cycles, shade based on proximity to another object's geometry How to code tridiagonal matrix with periodic elements How to respond to your boss's email about a coworker's accusation?

Remote front panels also can return additional error messages.

Join them; it only takes a minute: Sign up Amazon S3 PHP image save curl error up vote 2 down vote favorite I am trying to save an image to amazon's CURLE_SSH (79) An unspecified error occurred during the SSH session. The given proxy host could not be resolved. 6 Couldn't resolve host. Curl Error Buffer The main reason why Curl Error 61 exist are many.

CURLE_RECV_ERROR (56) Failure with receiving network data. This error occurs if the DataSocket item name contains "/", "\", "?", "=", or "&". 1140 Exceeded maximum DataSocket item count. I saw another thread suggesting disable ssl or importing the ssl certificate into your porgram share|improve this answer answered Dec 7 '11 at 0:51 pandaslow 111 add a comment| up vote navigate to this website asked 4 years ago viewed 2576 times Upcoming Events 2016 Community Moderator Election ends in 3 days Related 1PHP curl post to login to wordpress1Simulating a POST with PHP & cURL0cURL

Overview Tutorial Errors Examples Symbols Index Easy Interface Multi Interface Share Interface curl / libcurl / API / Error Codes libcurl error codes NAME libcurl-errors - error codes in libcurl DESCRIPTION Make a "Ceeeeeeee" program PPCG Jeopardy: Cops Why do some stocks have a higher margin requirement? The error buffer might contain more specific information about which exact option it concerns. CURLE_ABORTED_BY_CALLBACK (42) Aborted by callback.

CURLE_RANGE_ERROR (33) The server does not support or accept range requests. CURLE_FUNCTION_NOT_FOUND (41) Function not found. The server administrator must specify the VIs that clients can view or control. 1350 Requested VI is broken and cannot be viewed or controlled. 1351 Requested VI is not a standard The client and server computers must be running the same version of LabVIEW.

Why does the '!!' shortcut fail to execute the previously run command? CURLE_HTTP_RETURNED_ERROR (22) This is returned if CURLOPT_FAILONERROR is set TRUE and the HTTP server returns an error code that is >= 400. The specified time-out period was reached according to the conditions. 29 FTP couldn't set ASCII. Those who doesn�t have any idea about computer troubleshooting find cURL - Changes these errors alarming.

You really want the error buffer and read the message there as it pinpoints the problem slightly more. A memory allocation request failed. 28 Operation timeout. Listed below are some of the errors and fixes you must know about. permission?) 61 Unrecognized transfer encoding Reference MaterialConfiguration Table and Directive ListError code list for failed FTP and HTTP remote webserver log transfersInteger Field ListRegular Field ListRegular Report List ©2016 Google Privacy

CURLE_UPLOAD_FAILED (25) Failed starting the upload. You cannot initiate a remote panel connection to a Real-Time target while also using a host VI to connect to the target. This return code only appears if --fail is used. 23 Write error. After setting the correct time get_object and also create_object worked correctly share|improve this answer answered Nov 27 '12 at 11:48 Oliver Schnell 213 add a comment| up vote 1 down vote

The LDAP library was not found. 41 Function not found. Couldn't connect to the host we got in the 227-line. 17 FTP couldn't set binary. CURLE_SSL_CERTPROBLEM (58) problem with the local client certificate.